Re: [code] [textadept] ncurses on OS X

From: Mitchell <m.att.foicica.com>
Date: Mon, 22 Apr 2013 08:06:35 -0400 (Eastern Daylight Time)

Robert,

On Mon, 22 Apr 2013, Robert wrote:

> Hi Mitchell,
>
> I tried again with a recent version using Chris' script.
> Now I get
>
> $ make osx-curses
> g++ -c -arch i386 -mdynamic-no-pic -mmacosx-version-min=10.5
> -pedantic -Os -DCURSES -DSCI_LEXER -DNDEBUG -DG_THREADS_IMPL_NONE
> -Iscintilla/include -Iscintilla/src -Iscintilla/lexlib -Wall
> -Wno-missing-braces -Wno-char-subscripts -Wno-long-long
> -Iscintilla/term scintilla/term/ScintillaTerm.cxx
> scintilla/term/ScintillaTerm.cxx:72: error: ISO C++ forbids
> declaration of ‘cchar_t’ with no type
> scintilla/term/ScintillaTerm.cxx:72: error: expected ‘;’ before ‘*’ token
> scintilla/term/ScintillaTerm.cxx: In member function ‘virtual void
> SurfaceImpl::AlphaRectangle(PRectangle, int, ColourDesired, int,
> ColourDesired, int, int)’:
> scintilla/term/ScintillaTerm.cxx:318: error: invalid use of incomplete
> type ‘struct _win_st’
> /usr/include/curses.h:322: error: forward declaration of ‘struct _win_st’
> scintilla/term/ScintillaTerm.cxx: In member function ‘virtual void
> SurfaceImpl::DrawTextTransparent(PRectangle, Font&, XYPOSITION, const
> char*, int, ColourDesired)’:
> scintilla/term/ScintillaTerm.cxx:375: error: invalid use of incomplete
> type ‘struct _win_st’
> /usr/include/curses.h:322: error: forward declaration of ‘struct _win_st’
> make: *** [ScintillaTerm.o] Error 1
>
> Any pointers?

Get latest scinterm hg. This was fixed over the weekend.

Cheers,
Mitchell

-- 
You are subscribed to code.att.foicica.com.
To change subscription settings, send an e-mail to code+help.att.foicica.com.
To unsubscribe, send an e-mail to code+unsubscribe.att.foicica.com.
Received on Mon 22 Apr 2013 - 08:06:35 EDT

This archive was generated by hypermail 2.2.0 : Tue 23 Apr 2013 - 06:54:12 EDT