[code] [textadept] ScintillaTerm.cxx compile error

From: Parke <parke.nexus.att.gmail.com>
Date: Tue, 24 Dec 2013 18:38:03 -0800

Hi,

I am trying to compile Textadept (specifically the curses version) on
Ubuntu 13.04. I have been following these instructions:
http://foicica.com/textadept/12_Compiling.html

The GTK version of Textadept compiles and runs.

However, when I "make curses", I get the following error:

g++ -c -pedantic -Os -DCURSES -D_XOPEN_SOURCE_EXTENDED -DSCI_LEXER
-DNDEBUG -DG_THREADS_IMPL_NONE -Iscintilla/include -Iscintilla/src
-Iscintilla/lexlib -Wall -Wno-missing-braces -Wno-char-subscripts
-Wno-long-long -Iscintilla/term \
                scintilla/term/ScintillaTerm.cxx -o ScintillaTerm.o
scintilla/term/ScintillaTerm.cxx: In constructor :
scintilla/term/ScintillaTerm.cxx:804:8: error: has no member named
scintilla/term/ScintillaTerm.cxx:805:8: error: has no member named
scintilla/term/ScintillaTerm.cxx:822:8: error: has no member named
scintilla/term/ScintillaTerm.cxx:823:8: error: has no member named
scintilla/term/ScintillaTerm.cxx:824:8: error: has no member named
make: *** [ScintillaTerm.o] Error 1

I think the identifier in the error messages ("a" with a caret on top)
is how my terminal represents/prints the null string. (But I could be
wrong about this.)

I've looked at the specified lines in ScintillaTerm.cxx, but I cannot
figure out what is causing the error.

Any advice would be appreciated. Thanks!

-Parke

-- 
You are subscribed to code.att.foicica.com.
To change subscription settings, send an e-mail to code+help.att.foicica.com.
To unsubscribe, send an e-mail to code+unsubscribe.att.foicica.com.
Received on Tue 24 Dec 2013 - 21:38:03 EST

This archive was generated by hypermail 2.2.0 : Wed 25 Dec 2013 - 06:49:15 EST